Reaction Details
TargetDNA polymerase catalytic subunit
LigandBDBM222925
Substrate/Competitorn/a
Meas. Tech.HCMV Polymerase LANCE TR-FRET Assay
pH7.5±n/a
IC50 110±n/a nM
Commentsextracted
Citation Fader, LLepage, OBailey, MBeaulieu, PLBilodeau, FCarson, RJGiroux, AGodbout, CMoreau, BNaud, JParisien, MPoirier, MPoirier, MSurprenant, SThibeault, C Cytomegalovirus inhibitor compounds US Patent US9315499 Publication Date 4/19/2016
 
DNA polymerase catalytic subunit
Name:DNA polymerase catalytic subunit
Type:Protein
Mol. Mass.:137111.39
Organism:Human cytomegalovirus (HCMV strain AD169)
Description:P08546
Residue:1242
BDBM222925
NameBDBM222925
Synonyms:US9315499, 6012
TypeSmall organic molecule
Emp. Form.C26H26ClN7O4
Mol. Mass.535.982
SMILESCn1cc(cn1)-c1cc2cc(C(=O)NCc3ccc(Cl)cc3)c(=O)n(CC(=O)N3CC(C)(O)C3)c2nc1N