Reaction Details
TargetDNA polymerase catalytic subunit
LigandBDBM222927
Substrate/Competitorn/a
Meas. Tech.HCMV Polymerase LANCE TR-FRET Assay
pH7.5±n/a
IC50 160±n/a nM
Commentsextracted
Citation Fader, LLepage, OBailey, MBeaulieu, PLBilodeau, FCarson, RJGiroux, AGodbout, CMoreau, BNaud, JParisien, MPoirier, MPoirier, MSurprenant, SThibeault, C Cytomegalovirus inhibitor compounds US Patent US9315499 Publication Date 4/19/2016
 
DNA polymerase catalytic subunit
Name:DNA polymerase catalytic subunit
Type:Protein
Mol. Mass.:137111.39
Organism:Human cytomegalovirus (HCMV strain AD169)
Description:P08546
Residue:1242
BDBM222927
NameBDBM222927
Synonyms:US9315499, 6018
TypeSmall organic molecule
Emp. Form.C28H29ClN6O4
Mol. Mass.549.021
SMILESCCn1cc(cn1)-c1c(O)cnc2n(CC(=O)N3CC(C)(C)C3)c(=O)c(cc12)C(=O)NCc1ccc(Cl)cc1