Reaction Details
TargetDNA polymerase catalytic subunit
LigandBDBM222928
Substrate/Competitorn/a
Meas. Tech.HCMV Polymerase LANCE TR-FRET Assay
pH7.5±n/a
IC50 83±n/a nM
Commentsextracted
Citation Fader, LLepage, OBailey, MBeaulieu, PLBilodeau, FCarson, RJGiroux, AGodbout, CMoreau, BNaud, JParisien, MPoirier, MPoirier, MSurprenant, SThibeault, C Cytomegalovirus inhibitor compounds US Patent US9315499 Publication Date 4/19/2016
 
DNA polymerase catalytic subunit
Name:DNA polymerase catalytic subunit
Type:Protein
Mol. Mass.:137111.39
Organism:Human cytomegalovirus (HCMV strain AD169)
Description:P08546
Residue:1242
BDBM222928
NameBDBM222928
Synonyms:US9315499, 6022
TypeSmall organic molecule
Emp. Form.C22H22BrClN5O5
Mol. Mass.551.798
SMILESNc1c(Br)cnc2n(CC(=O)N3CCC(CO)C3)c(=O)c(cc12)C(=O)NCc1ccc(Cl)oc1