Reaction Details
TargetDNA polymerase catalytic subunit
LigandBDBM222929
Substrate/Competitorn/a
Meas. Tech.HCMV Polymerase LANCE TR-FRET Assay
pH7.5±n/a
IC50 210±n/a nM
Commentsextracted
Citation Fader, LLepage, OBailey, MBeaulieu, PLBilodeau, FCarson, RJGiroux, AGodbout, CMoreau, BNaud, JParisien, MPoirier, MPoirier, MSurprenant, SThibeault, C Cytomegalovirus inhibitor compounds US Patent US9315499 Publication Date 4/19/2016
 
DNA polymerase catalytic subunit
Name:DNA polymerase catalytic subunit
Type:Protein
Mol. Mass.:137111.39
Organism:Human cytomegalovirus (HCMV strain AD169)
Description:P08546
Residue:1242
BDBM222929
NameBDBM222929
Synonyms:US9315499, 7002
TypeSmall organic molecule
Emp. Form.C24H23ClFN5O4
Mol. Mass.499.922
SMILESNC(=O)[C@@H]1C[C@H](F)CN1C(=O)CCn1c2ncccc2cc(C(=O)NCc2ccc(Cl)cc2)c1=O