Reaction Details
TargetTyrosine-protein kinase SYK [2-635]
LigandBDBM222955
Substrate/Competitorn/a
Meas. Tech.Chip Based Microfluidic Mobility Shift Assay
pH7.5±n/a
Temperature303.15±n/a K
IC50 2±n/a nM
Commentsextracted
Citation Buehlmayer, PSmith, ABThoma, GVan Eis, M Bicyclic heteroaryl cycloalkyldiamine derivatives US Patent US9315500 Publication Date 4/19/2016
 
Tyrosine-protein kinase SYK [2-635]
Name:Tyrosine-protein kinase SYK [2-635]
Type:Protein
Mol. Mass.:71948.80
Organism:Homo sapiens (Human)
Description:Human Syk (2-635 aa) (UniProtKB: P43405)
Residue:634
BDBM222955
NameBDBM222955
Synonyms:US9315500, 1.1
TypeSmall organic molecule
Emp. Form.C22H23F2N7O
Mol. Mass.439.4611
SMILESCc1c[nH]c2c(Nc3nc(N[C@@H]4CCCC[C@@H]4N)c(F)c4cn[nH]c(=O)c34)cc(F)cc12