Reaction Details
TargetKappa-type opioid receptor
LigandBDBM50354578
Substrate/Competitorn/a
Meas. Tech.κ-Opioid Receptor Functional Assay
pH7.4±n/a
Temperature298.15±n/a K
EC50 0.56±n/a nM
Commentsextracted
Citation Reisch, HA 1,3-dioxanomorphides and 1,3-dioxanocodides US Patent US9315514 Publication Date 4/19/2016
 
Kappa-type opioid receptor
Name:Kappa-type opioid receptor
Type:G Protein-Coupled Receptor (GPCR)
Mol. Mass.:42648.76
Organism:Homo sapiens (Human)
Description:P41145
Residue:380
BDBM50354578
NameBDBM50354578
Synonyms:BUPRENORPHINE US11534436, Compound buprenorphine | US9315514, Buprenorphine
TypeSmall organic molecule
Emp. Form.C29H41NO4
Mol. Mass.467.6401
SMILESCO[C@@]12CC[C@@]3(C[C@@H]1[C@](C)(O)C(C)(C)C)[C@H]1Cc4ccc(O)c5O[C@@H]2[C@]3(CCN1CC1CC1)c45