Reaction Details
TargetGuanine nucleotide-binding protein subunit alpha-15/Metabotropic glutamate receptor 2
LigandBDBM222991
Substrate/Competitorn/a
Meas. Tech.Fluorescence Laser Imaging Plate Reader (FLIPR) Based Assay
EC50 1178±n/a nM
Citation Fiji, HDKelly, III, MJKern, JCLayton, MEPero, JEReif, AJRossi, MA Imidazopyridin-2-one derivatives US Patent US9315518 Publication Date 4/19/2016
 
Guanine nucleotide-binding protein subunit alpha-15/Metabotropic glutamate receptor 2
Name:Guanine nucleotide-binding protein subunit alpha-15/Metabotropic glutamate receptor 2
Synonyms:mGluR2 and G alpha 16
Type:Protein
Mol. Mass.:n/a
Description:n/a
Components:This complex has 2 components.
Component 1
Name:Metabotropic glutamate receptor 2
Type:Enzyme
Mol. Mass.:95584.88
Organism:Homo sapiens (Human)
Description:Q14416
Residue:872
Component 2
Name:Guanine nucleotide-binding protein subunit alpha-15
Synonyms:G-protein subunit alpha-16 GNA15 GNA16 | guanine nucleotide-binding protein subunit alpha-15
Type:Protein
Mol. Mass.:43577.62
Organism:Homo sapiens (Human)
Description:P30679
Residue:374
BDBM222991
NameBDBM222991
Synonyms:US9315518, 38-5
TypeSmall organic molecule
Emp. Form.C21H30N6O2
Mol. Mass.398.5019
SMILESCn1cnc(c1)C(=O)NCCCCc1ccc2n(CC(C)(C)C)c(=O)n(C)c2n1