Reaction Details
TargetMetabotropic glutamate receptor 2
LigandBDBM222968
Substrate/Competitorn/a
Meas. Tech.[35S]-GTPγS Assay
EC50 299.1±n/a nM
Citation Fiji, HDKelly, III, MJKern, JCLayton, MEPero, JEReif, AJRossi, MA Imidazopyridin-2-one derivatives US Patent US9315518 Publication Date 4/19/2016
 
Metabotropic glutamate receptor 2
Name:Metabotropic glutamate receptor 2
Type:Enzyme
Mol. Mass.:95584.88
Organism:Homo sapiens (Human)
Description:Q14416
Residue:872
BDBM222968
NameBDBM222968
Synonyms:US9315518, 2-9
TypeSmall organic molecule
Emp. Form.C25H29N5O2
Mol. Mass.431.5301
SMILESCn1c2nc(ccc2n(CC(C)(C)C)c1=O)C1=CC2CCC1CN2C(=O)c1cccnc1