Reaction Details
TargetMetabotropic glutamate receptor 2
LigandBDBM222975
Substrate/Competitorn/a
Meas. Tech.[35S]-GTPγS Assay
EC50 2820±n/a nM
Citation Fiji, HDKelly, III, MJKern, JCLayton, MEPero, JEReif, AJRossi, MA Imidazopyridin-2-one derivatives US Patent US9315518 Publication Date 4/19/2016
 
Metabotropic glutamate receptor 2
Name:Metabotropic glutamate receptor 2
Type:Enzyme
Mol. Mass.:95584.88
Organism:Homo sapiens (Human)
Description:Q14416
Residue:872
BDBM222975
NameBDBM222975
Synonyms:US9315518, 8-9
TypeSmall organic molecule
Emp. Form.C21H28N4O3
Mol. Mass.384.472
SMILESCn1c2nc(ccc2n(CC(C)(C)C)c1=O)C1=CC2CN(CC2C1)C(=O)CO