Reaction Details
TargetMetabotropic glutamate receptor 2
LigandBDBM222977
Substrate/Competitorn/a
Meas. Tech.[35S]-GTPγS Assay
EC50 54.7±n/a nM
Citation Fiji, HDKelly, III, MJKern, JCLayton, MEPero, JEReif, AJRossi, MA Imidazopyridin-2-one derivatives US Patent US9315518 Publication Date 4/19/2016
 
Metabotropic glutamate receptor 2
Name:Metabotropic glutamate receptor 2
Type:Enzyme
Mol. Mass.:95584.88
Organism:Homo sapiens (Human)
Description:Q14416
Residue:872
BDBM222977
NameBDBM222977
Synonyms:US9315518, 8-38
TypeSmall organic molecule
Emp. Form.C23H27N5O3
Mol. Mass.421.4922
SMILESCn1c2nc(ccc2n(CC(C)(C)C)c1=O)C1=CC2CN(CC2C1)C(=O)c1ncco1