Reaction Details
TargetIsoform 2 of MAP kinase-interacting serine/threonine-protein kinase 1 (MNK1a) 344D]
LigandBDBM223022
Substrate/Competitorn/a
Meas. Tech.MKNK1 Kinase Assay
pH7.5±n/a
Temperature295.15±n/a K
IC50 27±n/a nM
Commentsextracted
Citation Eis, KPuehler, FZorn, LScholz, ALienau, PGnoth, MJBömer, UGünther, J Substituted imidazopyridazines US Patent US9320737 Publication Date 4/26/2016
 
Isoform 2 of MAP kinase-interacting serine/threonine-protein kinase 1 (MNK1a) 344D]
Name:Isoform 2 of MAP kinase-interacting serine/threonine-protein kinase 1 (MNK1a) 344D]
Type:Protein
Mol. Mass.:47416.00
Organism:Homo sapiens (Human)
Description:Q9BUB5-2 with T344D
Residue:424
BDBM223022
NameBDBM223022
Synonyms:US9320737, I.3
TypeSmall organic molecule
Emp. Form.C19H19N3O2S
Mol. Mass.353.438
SMILESCSCCCCOc1ccc2ncc(-c3cc4ccccc4o3)n2n1