Reaction Details
Target5'-nucleotidase
LigandBDBM223078
Substrate/Competitorn/a
Meas. Tech.Ecto-5'-Nucleotidase Inhibition Assay
pH7.4±n/a
Temperature310.15±n/a K
IC50 2890±410 nM
Commentsextracted
Citation Channar, PAShah, SJHassan, SNisa, ZULecka, JSévigny, JBajorath, JSaeed, AIqbal, J Isonicotinohydrazones as inhibitors of alkaline phosphatase and ecto-5'-nucleotidase. Chem Biol Drug Des89:365-370 (2017) 
 
5'-nucleotidase
Name:5'-nucleotidase
Type:Enzyme
Mol. Mass.:63971.44
Organism:Rattus norvegicus (Rat)
Description:P21588
Residue:576
BDBM223078
NameBDBM223078
Synonyms:(E)-N'-(Pyridin-4'-ylmethylene)isonicotinohydrazide (3h)
TypeSmall organic molecule
Emp. Form.C12H10N4O
Mol. Mass.226.234
SMILESO=C(N\N=C\c1ccncc1)c1ccncc1