Reaction Details
TargetAlkaline phosphatase, tissue-nonspecific isozyme
LigandBDBM223076
Substrate/Competitorn/a
Meas. Tech.Alkaline Phosphatase Inhibition Assay
pH9.8±n/a
Temperature310.15±n/a K
IC50 1820±630 nM
Commentsextracted
Citation Channar, PAShah, SJHassan, SNisa, ZULecka, JSévigny, JBajorath, JSaeed, AIqbal, J Isonicotinohydrazones as inhibitors of alkaline phosphatase and ecto-5'-nucleotidase. Chem Biol Drug Des89:365-370 (2017) 
 
Alkaline phosphatase, tissue-nonspecific isozyme
Name:Alkaline phosphatase, tissue-nonspecific isozyme
Type:Protein
Mol. Mass.:57195.60
Organism:Bos taurus (Cattle)
Description:P09487
Residue:524
BDBM223076
NameBDBM223076
Synonyms:(E)-N'-(3'-Nitrobenzylidene)isonicotinohydrazide (3f)
TypeSmall organic molecule
Emp. Form.C13H10N4O3
Mol. Mass.270.2435
SMILES[O-][N+](=O)c1cccc(\C=N\NC(=O)c2ccncc2)c1