Reaction Details
TargetAlkaline phosphatase, tissue-nonspecific isozyme
LigandBDBM223077
Substrate/Competitorn/a
Meas. Tech.Alkaline Phosphatase Inhibition Assay
pH9.8±n/a
Temperature310.15±n/a K
IC50 350±10.0 nM
Commentsextracted
Citation Channar, PAShah, SJHassan, SNisa, ZULecka, JSévigny, JBajorath, JSaeed, AIqbal, J Isonicotinohydrazones as inhibitors of alkaline phosphatase and ecto-5'-nucleotidase. Chem Biol Drug Des89:365-370 (2017) 
 
Alkaline phosphatase, tissue-nonspecific isozyme
Name:Alkaline phosphatase, tissue-nonspecific isozyme
Type:Protein
Mol. Mass.:57195.60
Organism:Bos taurus (Cattle)
Description:P09487
Residue:524
BDBM223077
NameBDBM223077
Synonyms:(E)-N'-(4'-Hydroxy-3-methoxybenzylidene)isonicotinohydrazide (3g)
TypeSmall organic molecule
Emp. Form.C14H13N3O3
Mol. Mass.271.2713
SMILESCOc1cc(\C=N\NC(=O)c2ccncc2)ccc1O