Reaction Details
TargetAlkaline phosphatase, tissue-nonspecific isozyme
LigandBDBM223080
Substrate/Competitorn/a
Meas. Tech.Alkaline Phosphatase Inhibition Assay
pH9.8±n/a
Temperature310.15±n/a K
IC50 1060±260 nM
Commentsextracted
Citation Channar, PAShah, SJHassan, SNisa, ZULecka, JSévigny, JBajorath, JSaeed, AIqbal, J Isonicotinohydrazones as inhibitors of alkaline phosphatase and ecto-5'-nucleotidase. Chem Biol Drug Des89:365-370 (2017) 
 
Alkaline phosphatase, tissue-nonspecific isozyme
Name:Alkaline phosphatase, tissue-nonspecific isozyme
Type:Protein
Mol. Mass.:57195.60
Organism:Bos taurus (Cattle)
Description:P09487
Residue:524
BDBM223080
NameBDBM223080
Synonyms:(E)-N'-(1-(3-(4-fluorophenyl)-5-phenyl-4,5-dihydro-1H-pyrazol-1yl)ethylidene)isonicotino hydrazide (3j)
TypeSmall organic molecule
Emp. Form.C23H20FN5O
Mol. Mass.401.4362
SMILESC\C(=N/NC(=O)c1ccncc1)N1N=C(CC1c1ccccc1)c1ccc(F)cc1