Reaction Details
TargetEpithelial discoidin domain-containing receptor 1
LigandBDBM223087
Substrate/Competitorn/a
Meas. Tech.LanthaScreen Eu Kinase Activity Assay
pH7.5±n/a
Temperature298.15±n/a K
IC50 7.14±1.26 nM
Commentsextracted
Citation Liu, LHussain, MLuo, JDuan, AChen, CTu, ZZhang, J Synthesis and biological evaluation of novel dasatinib analogues as potent DDR1 and DDR2 kinase inhibitors. Chem Biol Drug Des89:420-427 (2017) 
 
Epithelial discoidin domain-containing receptor 1
Name:Epithelial discoidin domain-containing receptor 1
Type:Tyrosine-protein kinase
Mol. Mass.:101130.02
Organism:Homo sapiens (Human)
Description:Q08345
Residue:913
BDBM223087
NameBDBM223087
Synonyms:Phenyl 4-(6-((5-((2-chloro-6-methylphenyl)carbamoyl)thiazol-2-yl)amino)-2-methylpyrimidin-4-yl)-piperazine-1-carboxylate (3g)
TypeSmall organic molecule
Emp. Form.C27H26ClN7O3S
Mol. Mass.564.058
SMILESCc1cccc(Cl)c1NC(=O)c1cnc(Nc2cc(nc(C)n2)N2CCN(CC2)C(=O)Oc2ccccc2)s1