Reaction Details
TargetTyrosine-protein kinase ABL1
LigandBDBM223089
Substrate/Competitorn/a
Meas. Tech.FRET-Based Z'-Lyte Assay
pH7.5±n/a
Temperature298.15±n/a K
IC50 0.248±0.021 nM
Commentsextracted
Citation Liu, LHussain, MLuo, JDuan, AChen, CTu, ZZhang, J Synthesis and biological evaluation of novel dasatinib analogues as potent DDR1 and DDR2 kinase inhibitors. Chem Biol Drug Des89:420-427 (2017) 
 
Tyrosine-protein kinase ABL1
Name:Tyrosine-protein kinase ABL1
Type:Enzyme
Mol. Mass.:122897.30
Organism:Homo sapiens (Human)
Description:P00519
Residue:1130
BDBM223089
NameBDBM223089
Synonyms:2-Chloroethyl 4-(6-((5-((2-chloro-6-methylphenyl)carbamoyl)thiazol-2-yl)amino)-2-methylpyrimidin-4-yl)-piperazine-1-carboxylate (3i)
TypeSmall organic molecule
Emp. Form.C23H25Cl2N7O3S
Mol. Mass.550.461
SMILESCc1nc(Nc2ncc(s2)C(=O)Nc2c(C)cccc2Cl)cc(n1)N1CCN(CC1)C(=O)OCCCl