Reaction Details
TargetTyrosine-protein kinase ABL1
LigandBDBM223099
Substrate/Competitorn/a
Meas. Tech.FRET-Based Z'-Lyte Assay
pH7.5±n/a
Temperature298.15±n/a K
IC50 0.602±0.087 nM
Commentsextracted
Citation Liu, LHussain, MLuo, JDuan, AChen, CTu, ZZhang, J Synthesis and biological evaluation of novel dasatinib analogues as potent DDR1 and DDR2 kinase inhibitors. Chem Biol Drug Des89:420-427 (2017) 
 
Tyrosine-protein kinase ABL1
Name:Tyrosine-protein kinase ABL1
Type:Enzyme
Mol. Mass.:122897.30
Organism:Homo sapiens (Human)
Description:P00519
Residue:1130
BDBM223099
NameBDBM223099
Synonyms:Isobutyl 3-(6-((5-((2-chloro-6-methylphenyl)carbamoyl)thiazol-2-yl)amino)-2-methylpyrimidin-4-yl)pyrrolidine-1-carboxylate (5f)
TypeSmall organic molecule
Emp. Form.C25H29ClN6O3S
Mol. Mass.529.054
SMILESCC(C)COC(=O)N1CCC(C1)c1cc(Nc2ncc(s2)C(=O)Nc2c(C)cccc2Cl)nc(C)n1