Reaction Details
TargetAlpha-glucosidase MAL32
LigandBDBM223120
Substrate/Competitorn/a
Meas. Tech.In Vitro α-Glucosidase Inhibitory Assay
pH6.8±n/a
IC50 77790±1570 nM
Commentsextracted
Citation Wang, GWang, JHe, DLi, XLi, JPeng, Z Synthesis, in vitro evaluation and molecular docking studies of novel coumarin-isatin derivatives as a-glucosidase inhibitors. Chem Biol Drug Des89:456-463 (2017) 
 
Alpha-glucosidase MAL32
Name:Alpha-glucosidase MAL32
Type:Hydrolase
Mol. Mass.:68132.36
Organism:Saccharomyces cerevisiae
Description:Purchased from Wako Fine Chemicals Co. Ltd.
Residue:584
BDBM223120
NameBDBM223120
Synonyms:(Z)-N'-(1-(3-fluorobenzyl)-5-methyl-2-oxoindolin-3-ylidene)-2-((2-oxo-2H-chromen-7-yl)oxy)acetohydrazide (5o)
TypeSmall organic molecule
Emp. Form.C27H20FN3O5
Mol. Mass.485.4632
SMILESCc1ccc2N(Cc3cccc(F)c3)C(=O)\C(=N/NC(=O)COc3ccc4ccc(=O)oc4c3)c2c1