Reaction Details
TargetProtein arginine N-methyltransferase 5
LigandBDBM223131
Substrate/Competitorn/a
Meas. Tech.In Vitro Enzymatic Assay
Temperature298.15±n/a K
IC50 2.1e+3±n/a nM
Commentsextracted
Citation Ji, SMa, SWang, WJHuang, SZWang, TQXiang, RHu, YGChen, QLi, LLYang, SY Discovery of selective protein arginine methyltransferase 5 inhibitors and biological evaluations. Chem Biol Drug Des89:585-598 (2017) 
 
Protein arginine N-methyltransferase 5
Name:Protein arginine N-methyltransferase 5
Type:Enzyme
Mol. Mass.:72679.99
Organism:Homo sapiens (Human)
Description:O14744
Residue:637
BDBM223131
NameBDBM223131
Synonyms:2-((5-(4-methoxyphenyl)furan-2-yl)methylene)hydrazinecarboxamide (4h)
TypeSmall organic molecule
Emp. Form.C13H13N3O3
Mol. Mass.259.2606
SMILESCOc1ccc(cc1)-c1ccc(\C=N\NC(N)=O)o1