Reaction Details
TargetProtein arginine N-methyltransferase 5
LigandBDBM223133
Substrate/Competitorn/a
Meas. Tech.In Vitro Enzymatic Assay
Temperature298.15±n/a K
IC50 1.3e+4±n/a nM
Commentsextracted
Citation Ji, SMa, SWang, WJHuang, SZWang, TQXiang, RHu, YGChen, QLi, LLYang, SY Discovery of selective protein arginine methyltransferase 5 inhibitors and biological evaluations. Chem Biol Drug Des89:585-598 (2017) 
 
Protein arginine N-methyltransferase 5
Name:Protein arginine N-methyltransferase 5
Type:Enzyme
Mol. Mass.:72679.99
Organism:Homo sapiens (Human)
Description:O14744
Residue:637
BDBM223133
NameBDBM223133
Synonyms:2-((5-(2-amino-4-chlorophenyl)furan-2-yl)methylene)hydrazinecarboxamide (4m)
TypeSmall organic molecule
Emp. Form.C12H11ClN4O2
Mol. Mass.278.694
SMILESNC(=O)N\N=C\c1ccc(o1)-c1ccc(Cl)cc1N