Reaction Details
TargetHistone-arginine methyltransferase CARM1
LigandBDBM223137
Substrate/Competitorn/a
Meas. Tech.In Vitro Enzymatic Assay
Temperature298.15±n/a K
IC50>1.00e+5±n/a nM
Commentsextracted
Citation Ji, SMa, SWang, WJHuang, SZWang, TQXiang, RHu, YGChen, QLi, LLYang, SY Discovery of selective protein arginine methyltransferase 5 inhibitors and biological evaluations. Chem Biol Drug Des89:585-598 (2017) 
 
Histone-arginine methyltransferase CARM1
Name:Histone-arginine methyltransferase CARM1
Type:Protein
Mol. Mass.:65855.47
Organism:Homo sapiens (Human)
Description:Q86X55
Residue:608
BDBM223137
NameBDBM223137
Synonyms:P5i-6
TypeSmall organic molecule
Emp. Form.C12H10ClN3O2
Mol. Mass.263.68
SMILESNC(=O)N\N=C\c1ccc(o1)-c1ccc(Cl)cc1