Reaction Details
TargetEnoyl-[acyl-carrier-protein] reductase [NADH]
LigandBDBM223192
Substrate/Competitorn/a
Meas. Tech.Inhibition Kinetics Assay
pH8±0
Temperature298.15±0 K
Ki 0.51±0.01 nM
Citation Neckles, CEltschkner, SCummings, JEHirschbeck, MDaryaee, FBommineni, GRZhang, ZSpagnuolo, LYu, WDavoodi, SSlayden, RAKisker, CTonge, PJ Rationalizing the Binding Kinetics for the Inhibition of the Burkholderia pseudomallei FabI1 Enoyl-ACP Reductase. Biochemistry56:1865-1878 (2017) 
 
Enoyl-[acyl-carrier-protein] reductase [NADH]
Name:Enoyl-[acyl-carrier-protein] reductase [NADH]
Synonyms:Enoyl-ACP reductase (FabI1)
Type:Enzyme
Mol. Mass.:27824.56
Organism:Burkholderia pseudomallei
Description:Q3JG55
Residue:253
BDBM223192
NameBDBM223192
Synonyms:PT444
TypeSmall organic molecule
Emp. Form.C15H13NO2
Mol. Mass.239.2692
SMILESCCc1ccc(Oc2ccccc2C#N)c(O)c1