Reaction Details
TargetEnoyl-[acyl-carrier-protein] reductase [NADH]
LigandBDBM50373349
Substrate/Competitorn/a
Meas. Tech.Inhibition Kinetics Assay
pH8±0
Temperature298.15±0 K
Ki 158±0 nM
Citation Neckles, CEltschkner, SCummings, JEHirschbeck, MDaryaee, FBommineni, GRZhang, ZSpagnuolo, LYu, WDavoodi, SSlayden, RAKisker, CTonge, PJ Rationalizing the Binding Kinetics for the Inhibition of the Burkholderia pseudomallei FabI1 Enoyl-ACP Reductase. Biochemistry56:1865-1878 (2017) 
 
Enoyl-[acyl-carrier-protein] reductase [NADH]
Name:Enoyl-[acyl-carrier-protein] reductase [NADH]
Synonyms:Enoyl-ACP reductase (FabI1)
Type:Enzyme
Mol. Mass.:27824.56
Organism:Burkholderia pseudomallei
Description:Q3JG55
Residue:253
BDBM50373349
NameBDBM50373349
TypeSmall organic molecule
Emp. Form.C18H21NO4
Mol. Mass.315.3636
SMILESCCCCCCc1ccc(Oc2ccc(cc2)[N+]([O-])=O)c(O)c1