Reaction Details
TargetEnoyl-[acyl-carrier-protein] reductase [NADH]
LigandBDBM223194
Substrate/Competitorn/a
Meas. Tech.Inhibition Kinetics Assay
pH8±0
Temperature298.15±0 K
Ki 1134±5 nM
Citation Neckles, CEltschkner, SCummings, JEHirschbeck, MDaryaee, FBommineni, GRZhang, ZSpagnuolo, LYu, WDavoodi, SSlayden, RAKisker, CTonge, PJ Rationalizing the Binding Kinetics for the Inhibition of the Burkholderia pseudomallei FabI1 Enoyl-ACP Reductase. Biochemistry56:1865-1878 (2017) 
 
Enoyl-[acyl-carrier-protein] reductase [NADH]
Name:Enoyl-[acyl-carrier-protein] reductase [NADH]
Synonyms:Enoyl-ACP reductase (FabI1)
Type:Enzyme
Mol. Mass.:27824.56
Organism:Burkholderia pseudomallei
Description:Q3JG55
Residue:253
BDBM223194
NameBDBM223194
Synonyms:PT400
TypeSmall organic molecule
Emp. Form.C18H21FO2
Mol. Mass.288.3565
SMILESCCCCCCc1cc(O)c(Oc2ccccc2)cc1F