Reaction Details
TargetTyrosine-protein phosphatase non-receptor type 1 [1-322]
LigandBDBM223197
Substrate/Competitorn/a
Meas. Tech.PTP1B Activity Assay
pH7±0
Ki 2.7e+4±n/a nM
IC50 5.4e+4± 1e+3 nM
Citation Punthasee, PLaciak, ARCummings, AHRuddraraju, KVLewis, SMHillebrand, RSingh, HTanner, JJGates, KS Covalent Allosteric Inactivation of Protein Tyrosine Phosphatase 1B (PTP1B) by an Inhibitor-Electrophile Conjugate. Biochemistry56:2051-2060 (2017) 
 
Tyrosine-protein phosphatase non-receptor type 1 [1-322]
Name:Tyrosine-protein phosphatase non-receptor type 1 [1-322]
Type:Enzyme
Mol. Mass.:37368.76
Organism:Homo sapiens (Human)
Description:Human PTP1B truncation (1-322 aa)
Residue:322
BDBM223197
NameBDBM223197
Synonyms:2-Bromo-N-[3'-(1,1-dioxido-4-oxo-1,2,5-thiadiazolidin-2-yl)-4'-methyl[1,1'-biphenyl]-4-yl]-acetamide (5a)
TypeSmall organic molecule
Emp. Form.C17H16BrN3O4S
Mol. Mass.438.296
SMILESCc1ccc(cc1N1CC(=O)NS1(=O)=O)-c1ccc(NC(=O)CBr)cc1