Reaction Details
TargetCalcium/calmodulin-dependent protein kinase type IV [15-340]
LigandBDBM223208
Substrate/Competitorn/a
Meas. Tech.Molecular Docking
Ki 1351.35±29.22 nM
Citation Jameel, ENaz, HKhan, PTarique, MKumar, JMumtazuddin, SAhamad, SIslam, AAhmad, FHoda, NHassan, MI Design, synthesis, and biological evaluation of pyrimidine derivatives as potential inhibitors of human calcium/calmodulin-dependent protein kinase IV. Chem Biol Drug Des89:741-754 (2017) 
 
Calcium/calmodulin-dependent protein kinase type IV [15-340]
Name:Calcium/calmodulin-dependent protein kinase type IV [15-340]
Type:Enzyme
Mol. Mass.:39277.89
Organism:Homo sapiens (Human)
Description:PDB 2W4O used as reference
Residue:349
BDBM223208
NameBDBM223208
Synonyms:7-((6-((5-Methoxy-1H-benzo[d]imidazol-2-yl)thio)pyrimidin-4-yl)oxy)-4-methyl-2H-chromen-2-one (Molecule 5)
TypeSmall organic molecule
Emp. Form.C22H16N4O4S
Mol. Mass.432.452
SMILESCOc1ccc2[nH]c(Sc3cc(Oc4ccc5c(C)cc(=O)oc5c4)ncn3)nc2c1