Reaction Details
TargetCalcium/calmodulin-dependent protein kinase type IV [15-340]
LigandBDBM223209
Substrate/Competitorn/a
Meas. Tech.Molecular Docking
Ki 0.01087±0.00021 nM
Citation Jameel, ENaz, HKhan, PTarique, MKumar, JMumtazuddin, SAhamad, SIslam, AAhmad, FHoda, NHassan, MI Design, synthesis, and biological evaluation of pyrimidine derivatives as potential inhibitors of human calcium/calmodulin-dependent protein kinase IV. Chem Biol Drug Des89:741-754 (2017) 
 
Calcium/calmodulin-dependent protein kinase type IV [15-340]
Name:Calcium/calmodulin-dependent protein kinase type IV [15-340]
Type:Enzyme
Mol. Mass.:39277.89
Organism:Homo sapiens (Human)
Description:PDB 2W4O used as reference
Residue:349
BDBM223209
NameBDBM223209
Synonyms:8-((6-Chloropyrimidin-4-yl)oxy)quinoline (Compound 1)
TypeSmall organic molecule
Emp. Form.C13H8ClN3O
Mol. Mass.257.675
SMILESClc1cc(Oc2cccc3cccnc23)ncn1