Reaction Details
TargetLeukotriene C4 synthase
LigandBDBM223227
Substrate/CompetitorLTC4
Meas. Tech.In Vitro hLTC4 Synthase Enzyme Assay (Test A)
pH7.8±n/a
IC50 34±n/a nM
Commentsextracted
Citation Ronn, RLindh, CJRingberg, EAndersson, HBNilsson, PSchaal, WRRosenschold, MMNikitidis, ANikitidis, GJohannesson, PTyrcha, C Compounds and uses  US Patent US20160326143 Publication Date 11/10/2016
 
Leukotriene C4 synthase
Name:Leukotriene C4 synthase
Type:PROTEIN
Mol. Mass.:16575.59
Organism:Homo sapiens (Human)
Description:ChEMBL_961179
Residue:150
BDBM223227
LTC4
NameBDBM223227
Synonyms:2-(5-((4-Chlorobenzyl)(cyclopropylmethyl)amino)-3-methoxypicolinoyl)cyclopropanecarboxylic acid US20160326143, 2 | US9657001, 2
TypeSmall Organic Molecule
Emp. Form.C21H21ClN2O4
Mol. Mass.400.855
SMILESCOc1cc(cnc1C(=O)C1CC1C(O)=O)N(CC1CC1)c1ccc(Cl)cc1