Reaction Details
TargetLeukotriene C4 synthase
LigandBDBM223284
Substrate/CompetitorLTC4
Meas. Tech.In Vitro hLTC4 Synthase Enzyme Assay (Test A)
pH7.8±n/a
IC50 18±n/a nM
Commentsextracted
Citation Ronn, RLindh, CJRingberg, EAndersson, HBNilsson, PSchaal, WRRosenschold, MMNikitidis, ANikitidis, GJohannesson, PTyrcha, C Compounds and uses  US Patent US20160326143 Publication Date 11/10/2016
 
Leukotriene C4 synthase
Name:Leukotriene C4 synthase
Type:PROTEIN
Mol. Mass.:16575.59
Organism:Homo sapiens (Human)
Description:ChEMBL_961179
Residue:150
BDBM223284
LTC4
NameBDBM223284
Synonyms:2-(5-((Cyclopropylmethyl)(4-methylnaphthalen-1-yl)amino)-4-methoxypyrimidine-2-carbonyl)cyclopropanecarboxylic acid US9657001, 59
TypeSmall Organic Molecule
Emp. Form.C25H25N3O4
Mol. Mass.431.4837
SMILESCOc1nc(ncc1N(CC1CC1)c1ccc(C)c2ccccc12)C(=O)C1CC1C(O)=O