Reaction Details
TargetLeukotriene C4 synthase
LigandBDBM223287
Substrate/CompetitorLTC4
Meas. Tech.In Vitro hLTC4 Synthase Enzyme Assay (Test B)
pH7.5±n/a
IC50 0.289±n/a nM
Commentsextracted
Citation Ronn, RLindh, CJRingberg, EAndersson, HBNilsson, PSchaal, WRRosenschold, MMNikitidis, ANikitidis, GJohannesson, PTyrcha, C Compounds and uses  US Patent US20160326143 Publication Date 11/10/2016
 
Leukotriene C4 synthase
Name:Leukotriene C4 synthase
Type:PROTEIN
Mol. Mass.:16575.59
Organism:Homo sapiens (Human)
Description:ChEMBL_961179
Residue:150
BDBM223287
LTC4
NameBDBM223287
Synonyms:(1S,2S)-2-({5-[(5-Chloro-2,4-difluorophenyl)(2-fluoro-2-methylpropyl)amino]-3-methoxypyrazin-2-yl}carbonyl)cyclopropanecarboxylic acid US9657001, 62
TypeSmall Organic Molecule
Emp. Form.C20H19ClF3N3O4
Mol. Mass.457.831
SMILESCOc1nc(cnc1C(=O)[C@H]1C[C@@H]1C(O)=O)N(CC(C)(C)F)c1cc(Cl)c(F)cc1F