Reaction Details
TargetTyrosine-protein kinase SYK
LigandBDBM291026
Substrate/Competitorn/a
Meas. Tech.In Vitro Assay
pH7.5±n/a
Temperature298.15±n/a K
IC50 5.5±n/a nM
Commentsextracted
Citation Jia, ZJVenkataramani, CHuang, WMehrotra, MSong, YXu, QBauer, SMRose, JWKane, BPandey, A Inhibitors of syk and JAK protein kinases US Patent US9579320 Publication Date 2/28/2017
 
Tyrosine-protein kinase SYK
Name:Tyrosine-protein kinase SYK
Type:Enzyme
Mol. Mass.:72079.99
Organism:Homo sapiens (Human)
Description:P43405
Residue:635
BDBM291026
NameBDBM291026
Synonyms:(S)-2-(2-amino-2-cyclopropylethylamino)-4-(1-methyl-1H-indol-4-ylamino)pyrimidine-5-carboxamide | US9579320, Example 482
TypeSmall organic molecule
Emp. Form.C19H23N7O
Mol. Mass.365.4322
SMILESCn1ccc2c(Nc3nc(NC[C@@H](N)C4CC4)ncc3C(N)=O)cccc12