Reaction Details
TargetCaspase-5
LigandBDBM85511
Substrate/Competitorn/a
Meas. Tech.Caspase Catalytic Activity Assay
pH7.4±n/a
IC50 1.0e+3± 1e+2 nM
Commentsextracted
Citation Smith, CESoti, SJones, TANakagawa, AXue, DYin, H Non-steroidal Anti-inflammatory Drugs Are Caspase Inhibitors. Cell Chem Biol24:281-292 (2017) 
 
Caspase-5
Name:Caspase-5
Type:Enzyme
Mol. Mass.:49760.80
Organism:Homo sapiens (Human)
Description:P51878
Residue:434
BDBM85511
NameBDBM85511
Synonyms:CAS_74103-07-4 Ketorolac tris salt | Toradol
TypeSmall organic molecule
Emp. Form.C15H13NO3
Mol. Mass.255.2686
SMILESOC(=O)C1CCn2c1ccc2C(=O)c1ccccc1