Reaction Details
TargetPancreatic alpha-amylase
LigandBDBM223314
Substrate/Competitorn/a
Meas. Tech.Inhibition Kinetics Assay
pH7±n/a
Ki 1.0±0.1 nM
Commentsextracted
Citation Jongkees, SACaner, STysoe, CBrayer, GDWithers, SGSuga, H Rapid Discovery of Potent and Selective Glycosidase-Inhibiting De Novo Peptides. Cell Chem Biol24:381-390 (2017) 
 
Pancreatic alpha-amylase
Name:Pancreatic alpha-amylase
Type:Protein
Mol. Mass.:57709.71
Organism:Homo sapiens (Human)
Description:n/a
Residue:511
BDBM223314
NameBDBM223314
Synonyms:YPYSCWARHVRIREN | piHA-D1
TypeSmall organic molecule
Emp. Form.C89H129N29O22S2
Mol. Mass.2021.288
SMILESCC[C@H](C)[C@H](NC(=O)[C@H](CCCNC(N)=N)NC(=O)[C@@H](NC(=O)[C@H](Cc1cnc[nH]1)NC(=O)[C@H](CCCNC(N)=N)NC(=O)[C@H](C)NC(=O)[C@H](Cc1c[nH]c2ccccc12)NC(=O)[C@H](CS)N1SCC(=O)N[C@@H](Cc2ccc(O)cc2)C(=O)N2CCC[C@H]2C(=O)N[C@@H](Cc2ccc(O)cc2)C(=O)N[C@@H](CO)C1=O)C(C)C)C(=O)N[C@@H](CCCNC(N)=N)C(=O)N[C@H](CCC(O)=O)C(=O)N[C@@H](CC(N)=O)C(N)=O