Reaction Details
TargetLysine-specific demethylase 5B
LigandBDBM191599
Substrate/Competitorn/a
Meas. Tech.AlphaScreen Assay
IC50 49±0.0 nM
Citation Tumber, ANuzzi, AHookway, ESHatch, SBVelupillai, SJohansson, CKawamura, ASavitsky, PYapp, CSzykowska, AWu, NBountra, CStrain-Damerell, CBurgess-Brown, NARuda, GFFedorov, OMunro, SEngland, KSNowak, RPSchofield, CJLa Thangue, NBPawlyn, CDavies, FMorgan, GAthanasou, NMüller, SOppermann, UBrennan, PE Potent and Selective KDM5 Inhibitor Stops Cellular Demethylation of H3K4me3 at Transcription Start Sites and Proliferation of MM1S Myeloma Cells. Cell Chem Biol24:371-380 (2017) 
 
Lysine-specific demethylase 5B
Name:Lysine-specific demethylase 5B
Type:Protein
Mol. Mass.:175659.67
Organism:Homo sapiens (Human)
Description:Q9UGL1
Residue:1544
BDBM191599
NameBDBM191599
Synonyms:KDOAM-21 | ethyl 2-(((2-((2-(dimethylamino)ethyl)(ethyl)amino)-2-oxoethyl)amino)methyl)isonicotinate (KDM5-C70)
TypeSmall organic molecule
Emp. Form.C17H28N4O3
Mol. Mass.336.4292
SMILESCCOC(=O)c1ccnc(CNCC(=O)N(CC)CCN(C)C)c1