Reaction Details
TargetLysine-specific demethylase 5B
LigandBDBM223319
Substrate/Competitorn/a
Meas. Tech.AlphaScreen Assay
IC50 270±0.0 nM
Citation Tumber, ANuzzi, AHookway, ESHatch, SBVelupillai, SJohansson, CKawamura, ASavitsky, PYapp, CSzykowska, AWu, NBountra, CStrain-Damerell, CBurgess-Brown, NARuda, GFFedorov, OMunro, SEngland, KSNowak, RPSchofield, CJLa Thangue, NBPawlyn, CDavies, FMorgan, GAthanasou, NMüller, SOppermann, UBrennan, PE Potent and Selective KDM5 Inhibitor Stops Cellular Demethylation of H3K4me3 at Transcription Start Sites and Proliferation of MM1S Myeloma Cells. Cell Chem Biol24:371-380 (2017) 
 
Lysine-specific demethylase 5B
Name:Lysine-specific demethylase 5B
Type:Protein
Mol. Mass.:175659.67
Organism:Homo sapiens (Human)
Description:Q9UGL1
Residue:1544
BDBM223319
NameBDBM223319
Synonyms:KDOAM-29
TypeSmall organic molecule
Emp. Form.C17H29N5O2
Mol. Mass.335.4445
SMILESCCN(CCN(C)C)C(=O)CNCc1cc(ccn1)C(=O)N(C)C