Reaction Details
TargetLysine-specific demethylase 5C
LigandBDBM223317
Substrate/Competitorn/a
Meas. Tech.AlphaScreen Assay
IC50 1e+3±1.3e+2 nM
Citation Tumber, ANuzzi, AHookway, ESHatch, SBVelupillai, SJohansson, CKawamura, ASavitsky, PYapp, CSzykowska, AWu, NBountra, CStrain-Damerell, CBurgess-Brown, NARuda, GFFedorov, OMunro, SEngland, KSNowak, RPSchofield, CJLa Thangue, NBPawlyn, CDavies, FMorgan, GAthanasou, NMüller, SOppermann, UBrennan, PE Potent and Selective KDM5 Inhibitor Stops Cellular Demethylation of H3K4me3 at Transcription Start Sites and Proliferation of MM1S Myeloma Cells. Cell Chem Biol24:371-380 (2017) 
 
Lysine-specific demethylase 5C
Name:Lysine-specific demethylase 5C
Type:PROTEIN
Mol. Mass.:175691.17
Organism:Homo sapiens (Human)
Description:P41229
Residue:1560
BDBM223317
NameBDBM223317
Synonyms:KDOAM-1
TypeSmall organic molecule
Emp. Form.C11H15N3O2
Mol. Mass.221.2557
SMILESOC(=O)c1ccnc(CN2CCNCC2)c1