Reaction Details
TargetIsoform D of Beta-secretase 1 (BACE-I-432)
LigandBDBM223381
Substrate/Competitorn/a
Meas. Tech.BACE1 Cell-Free Assay
pH4.5±n/a
Temperature310.15±n/a K
IC50 2±n/a nM
Commentsextracted
Citation Brodney, MABeck, EMButler, CRZhang, LO'Neill, BTBarreiro, GLaChapelle, EARogers, BN 2-amino-6-methyl-4,4a,5,6-tetrahydropyrano[3,4-d][1,3]thiazin-8a(8H)-yl-1,3-thiazol-4-yl amides US Patent US9315520 Publication Date 4/19/2016
 
Isoform D of Beta-secretase 1 (BACE-I-432)
Name:Isoform D of Beta-secretase 1 (BACE-I-432)
Type:Protein
Mol. Mass.:48152.67
Organism:Homo sapiens (Human)
Description:P56817-4
Residue:432
BDBM223381
NameBDBM223381
Synonyms:US9315520, 96 US9744173, Example 96
TypeSmall organic molecule
Emp. Form.C17H20F2N6O2S2
Mol. Mass.442.507
SMILESC[C@H]1C[C@H]2CSC(N)=N[C@]2(CO1)c1nc(NC(=O)c2nn(cc2C)C(F)F)cs1