Reaction Details
TargetCytochrome P450 2D6
LigandBDBM223398
Substrate/Competitorn/a
Meas. Tech.CYP2D6 Inhibition Assay
IC50<30±n/a nM
Citation Brodney, MABeck, EMButler, CRZhang, LO'Neill, BTBarreiro, GLaChapelle, EARogers, BN 2-amino-6-methyl-4,4a,5,6-tetrahydropyrano[3,4-d][1,3]thiazin-8a(8H)-yl-1,3-thiazol-4-yl amides US Patent US9315520 Publication Date 4/19/2016
 
Cytochrome P450 2D6
Name:Cytochrome P450 2D6
Type:Protein
Mol. Mass.:55774.82
Organism:Homo sapiens (Human)
Description:P10635
Residue:497
BDBM223398
NameBDBM223398
Synonyms:US9315520, Comparator 2 US9605007, Comparator 2 | US9744173, Comparator 2
TypeSmall organic molecule
Emp. Form.C20H20F3N5O3S
Mol. Mass.467.465
SMILESC[C@H]1C[C@H]2CSC(N)=N[C@]2(CO1)c1nc(NC(=O)c2ccc(OC(F)F)cn2)ccc1F