Reaction Details
TargetAldehyde dehydrogenase, dimeric NADP-preferring
LigandBDBM50447069
Substrate/Competitorn/a
Meas. Tech.Inhibiton Assay
pH7.5±n/a
IC50 1000±100 nM
Commentsextracted
Citation Hurley, TD Regulators of aldehyde dehydrogenase ALDH3A1 and related therapeutic methods US Patent US9320722 Publication Date 4/26/2016
 
Aldehyde dehydrogenase, dimeric NADP-preferring
Name:Aldehyde dehydrogenase, dimeric NADP-preferring
Type:Protein
Mol. Mass.:50394.38
Organism:Homo sapiens (Human)
Description:n/a
Residue:453
BDBM50447069
NameBDBM50447069
Synonyms:CHEMBL1492620 | US9328112, B37
TypeSmall organic molecule
Emp. Form.C15H11ClN2O3S
Mol. Mass.334.777
SMILESCC(=O)c1nc2ccccc2n1S(=O)(=O)c1ccc(Cl)cc1