Reaction Details
TargetAldehyde dehydrogenase 1A1
LigandBDBM223459
Substrate/CompetitorBDBM60952
Meas. Tech.Inhibiton Assay
pH7.5±n/a
IC50 700±n/a nM
Commentsextracted
Citation Hurley, TD Regulators of aldehyde dehydrogenase ALDH3A1 and related therapeutic methods US Patent US9320722 Publication Date 4/26/2016
 
Aldehyde dehydrogenase 1A1
Name:Aldehyde dehydrogenase 1A1
Type:Protein
Mol. Mass.:54862.21
Organism:Homo sapiens (Human)
Description:n/a
Residue:501
BDBM223459
BDBM60952
NameBDBM223459
Synonyms:US9320722, CD7
TypeSmall organic molecule
Emp. Form.C19H18N2O5
Mol. Mass.354.3566
SMILESCCOC(=O)CN1C(=O)C(O)(CC(=O)c2ccccn2)c2ccccc12