Reaction Details
TargetAldehyde dehydrogenase 1A1
LigandBDBM223461
Substrate/CompetitorBDBM60952
Meas. Tech.Inhibiton Assay
pH7.5±n/a
IC50 4000±n/a nM
Commentsextracted
Citation Hurley, TD Regulators of aldehyde dehydrogenase ALDH3A1 and related therapeutic methods US Patent US9320722 Publication Date 4/26/2016
 
Aldehyde dehydrogenase 1A1
Name:Aldehyde dehydrogenase 1A1
Type:Protein
Mol. Mass.:54862.21
Organism:Homo sapiens (Human)
Description:n/a
Residue:501
BDBM223461
BDBM60952
NameBDBM223461
Synonyms:US9320722, CD10
TypeSmall organic molecule
Emp. Form.C13H13NO4S2
Mol. Mass.311.377
SMILESCc1ccc(cc1)S(=O)(=O)NC(O)C(=O)c1cccs1