Reaction Details
TargetAldehyde dehydrogenase 1A1
LigandBDBM223464
Substrate/CompetitorBDBM60952
Meas. Tech.Inhibiton Assay
pH7.5±n/a
IC50 6500±n/a nM
Commentsextracted
Citation Hurley, TD Regulators of aldehyde dehydrogenase ALDH3A1 and related therapeutic methods US Patent US9320722 Publication Date 4/26/2016
 
Aldehyde dehydrogenase 1A1
Name:Aldehyde dehydrogenase 1A1
Type:Protein
Mol. Mass.:54862.21
Organism:Homo sapiens (Human)
Description:n/a
Residue:501
BDBM223464
BDBM60952
NameBDBM223464
Synonyms:US9320722, CD3
TypeSmall organic molecule
Emp. Form.C23H17N3O2
Mol. Mass.367.4
SMILESO=C1Nc2ccccc2C11Oc2ccccc2C2CC(=NN12)c1ccccc1