Reaction Details
TargetRAC-alpha serine/threonine-protein kinase [1-123]
LigandBDBM50338948
Substrate/Competitorn/a
Meas. Tech.SPR Competitive Binding Assay
Ki 8400±n/a nM
Citation Mahadevan, DMeuillet, EJMash, Jr., EAGokhale, VMPowis, GZhang, S Small molecule inhibitors of the pleckstrin homology domain and methods for using same US Patent US9320734 Publication Date 4/26/2016
 
RAC-alpha serine/threonine-protein kinase [1-123]
Name:RAC-alpha serine/threonine-protein kinase [1-123]
Type:Enzyme
Mol. Mass.:14664.42
Organism:Homo sapiens (Human)
Description:PLECKSTRIN HOMOLOGY DOMAIN RESIDUES 1-123 (PH Domain)
Residue:123
BDBM50338948
NameBDBM50338948
Synonyms:4-Octyl-N-(1,3,4-thiadiazol-2-yl)benzenesulfonamide US9320734, 153
TypeSmall organic molecule
Emp. Form.C16H23N3O2S2
Mol. Mass.353.503
SMILESCCCCCCCCc1ccc(cc1)S(=O)(=O)Nc1nncs1