Reaction Details
TargetBromodomain-containing protein 4
LigandBDBM205429
Substrate/Competitorn/a
Meas. Tech.Alpha Assay
pH7.4±n/a
Temperature298.15±n/a K
IC50 8354000±n/a nM
Commentsextracted
Citation Bradner, JEQi, J Compositions and methods for treating neoplasia, inflammatory disease and other disorders US Patent US9320741 Publication Date 4/26/2016
 
Bromodomain-containing protein 4
Name:Bromodomain-containing protein 4
Type:Protein
Mol. Mass.:152264.84
Organism:Homo sapiens (Human)
Description:O60885
Residue:1362
BDBM205429
NameBDBM205429
Synonyms: (R)-JQ1 (3) US10925881, Name (R)-JQ1 US11117865, Compound JQ1 US11406645, Compound JQ1 US9320741, (R)-JQ1
TypeSmall organic molecule
Emp. Form.C23H25ClN4O2S
Mol. Mass.456.988
SMILESCc1nnc2[C@@H](CC(=O)OC(C)(C)C)N=C(c3c(C)c(C)sc3-n12)c1ccc(Cl)cc1