Reaction Details
TargetMicrotubule-associated protein tau
LigandBDBM223580
Substrate/Competitorn/a
Meas. Tech.Inhibition Assay
pH7.6±n/a
IC50 590±n/a nM
Commentsextracted
Citation Sugimoto, HOkuda, MNakayama, SInoue, YSakata, YFujita, YTokizane, R Pyrazole derivative US Patent US9321752 Publication Date 4/26/2016
 
Microtubule-associated protein tau
Name:Microtubule-associated protein tau
Type:Protein
Mol. Mass.:78928.63
Organism:Homo sapiens (Human)
Description:P10636
Residue:758
BDBM223580
NameBDBM223580
Synonyms:US9321752, 23-2
TypeSmall organic molecule
Emp. Form.C26H26N4O2
Mol. Mass.426.5102
SMILESCOc1cc(OCc2ccccn2)ccc1\C=C\c1cc(\C=C\c2ccc(C)n2C)[nH]n1