Reaction Details
TargetBeta-secretase 1
LigandBDBM290697
Substrate/Competitorn/a
Meas. Tech.HTRF FRET Assay
pH5±n/a
Ki 70.0±n/a nM
Commentsextracted
Citation Cumming, JNScott, Jr., JDStamford, AWIserloh, UNeelamkavil, SFShao, PPWilson, JE C6-spiro iminothiadiazine dioxides as BACE inhibitors, compositions, and their use US Patent US9580396 Publication Date 2/28/2017
 
Beta-secretase 1
Name:Beta-secretase 1
Type:Protein
Mol. Mass.:55755.10
Organism:Homo sapiens (Human)
Description:P56817
Residue:501
BDBM290697
NameBDBM290697
Synonyms:US9580396, Example 1a
TypeSmall organic molecule
Emp. Form.C18H18ClN5O4S
Mol. Mass.435.885
SMILESCN1C(=N)N[C@@]2(CCOc3ccc(NC(=O)c4ccc(Cl)cn4)cc23)CS1(=O)=O