Reaction Details
TargetBeta-secretase 2
LigandBDBM291117
Substrate/Competitorn/a
Meas. Tech.BACE-2 Assay
pH5±n/a
Ki 29.0±n/a nM
Commentsextracted
Citation Cumming, JNScott, Jr., JDStamford, AWIserloh, UNeelamkavil, SFShao, PPWilson, JE C6-spiro iminothiadiazine dioxides as BACE inhibitors, compositions, and their use US Patent US9580396 Publication Date 2/28/2017
 
Beta-secretase 2
Name:Beta-secretase 2
Type:Protein
Mol. Mass.:56171.20
Organism:Homo sapiens (Human)
Description:Q9Y5Z0
Residue:518
BDBM291117
NameBDBM291117
Synonyms:US9580396, Example 2i
TypeSmall organic molecule
Emp. Form.C20H23N5O5S
Mol. Mass.445.492
SMILESCOc1cnc(C(=O)Nc2ccc3OCC[C@]4(CS(=O)(=O)N(C)C(=N)N4)c3c2)c(C)c1