Reaction Details
TargetBeta-secretase 1
LigandBDBM291119
Substrate/Competitorn/a
Meas. Tech.HTRF FRET Assay
pH5±n/a
Ki 15.0±n/a nM
Commentsextracted
Citation Cumming, JNScott, Jr., JDStamford, AWIserloh, UNeelamkavil, SFShao, PPWilson, JE C6-spiro iminothiadiazine dioxides as BACE inhibitors, compositions, and their use US Patent US9580396 Publication Date 2/28/2017
 
Beta-secretase 1
Name:Beta-secretase 1
Type:Protein
Mol. Mass.:55755.10
Organism:Homo sapiens (Human)
Description:P56817
Residue:501
BDBM291119
NameBDBM291119
Synonyms:US9580396, Example 2k
TypeSmall organic molecule
Emp. Form.C20H20N6O4S
Mol. Mass.440.476
SMILESCN1C(=N)N[C@@]2(CCOc3ccc(NC(=O)c4ncc(cc4C)C#N)cc23)CS1(=O)=O