Reaction Details
TargetBeta-secretase 2
LigandBDBM291124
Substrate/Competitorn/a
Meas. Tech.BACE-2 Assay
pH5±n/a
Ki 3.00±n/a nM
Commentsextracted
Citation Cumming, JNScott, Jr., JDStamford, AWIserloh, UNeelamkavil, SFShao, PPWilson, JE C6-spiro iminothiadiazine dioxides as BACE inhibitors, compositions, and their use US Patent US9580396 Publication Date 2/28/2017
 
Beta-secretase 2
Name:Beta-secretase 2
Type:Protein
Mol. Mass.:56171.20
Organism:Homo sapiens (Human)
Description:Q9Y5Z0
Residue:518
BDBM291124
NameBDBM291124
Synonyms:US9580396, Example 2p
TypeSmall organic molecule
Emp. Form.C17H18F2N6O4S
Mol. Mass.440.424
SMILESCN1C(=N)N[C@@]2(CCOc3ccc(NC(=O)c4ccn(n4)C(F)F)cc23)CS1(=O)=O